{"text_format":"1","workbook":"xlsx","n_sheets":11,"sheets":["Table of Contents","Accountability","Bus Data","Local Expenditures","Local Expenditures. (Continued)","Policy Questionnaire","Inventory","Obsolete Inventory","Buster Report","Official Summary","Policy Summary"],"not_rendered":{"charts":0,"images":100,"macros":1,"external_links":0,"defined_names":10,"comments":0,"pivot_tables":0},"unopened":[],"bounds":{"document_bytes":16777216,"sheet_cells":100000,"rows_first":2000,"rows_last":500,"rows_between":2000,"halvings":0,"cell_chars":16384,"cell_head_chars":4096},"cells_cut":0,"cells_raw":0,"read":"whole","date_system":"1900"}

{"sheet":"Table of Contents","index":0,"n_rows":28,"n_cols":2,"rows_kept":28,"cut":false,"hidden":false,"merged":[[3,1,6,1]]}
[]
[]
[null,"Updated: 2022-06-01 - Wright  "]
[null,"2022 TD-1 Report"]
[]
[]
[]
[]
[null,"Table of "]
[null,"Contents"]
{"$rows_left_out":19}
{"sheet":"Accountability","index":1,"n_rows":14,"n_cols":10,"rows_kept":14,"cut":false,"hidden":false,"merged":[[2,2,3,5],[1,9,4,9],[17,2,17,5],[15,2,16,5],[7,2,7,3],[9,2,9,3],[11,2,11,3],[13,2,13,3]]}
[]
[null,null,null,null,null,"Updated: 2022-06-01 - Wright  ",null,null,null,"See instructions\nfor \nSave & Email\nbuttons"]
[null,null,"Accountability"]
[]
[]
[]
[]
[null,null,"Electronic Signature:"]
[]
[null,null,"Title:"]
{"$rows_left_out":5}
{"sheet":"Bus Data","index":2,"n_rows":245,"n_cols":17,"rows_kept":245,"cut":false,"hidden":false,"merged":[[73,5,73,6],[36,5,36,8],[42,5,42,6],[43,5,43,8],[46,4,46,8],[47,5,47,6],[63,4,63,6],[64,4,64,6],[59,5,59,6],[60,5,60,6],[50,4,50,6],[48,5,48,6],[53,4,53,6],[54,4,54,6],[19,4,19,6],[12,4,12,6],[67,5,67,6],[69,5,69,6],[71,5,71,6],[20,5,20,6],[21,5,21,6],[22,5,22,6],[27,5,27,6],[28,5,28,6],[24,4,24,6],[26,4,26,6],[58,4,58,6],[61,4,61,6],[62,4,62,6],[55,4,55,6],[29,5,29,8],[32,5,32,6],[33,5,33,6],[35,5,35,8],[45,4,45,6],[5,2,5,6],[6,4,6,6],[8,4,8,6],[17,4,17,6],[9,5,9,6],[10,5,10,6],[13,5,13,6],[14,5,14,6],[15,5,15,6]]}
[]
[]
[null,null,null,null,null,null,"LEA Name",null,"LEA Number",null,null,null,null,null,null,"(Save, Email, and Print All options available on Accountability worksheet tab)"]
[null,null,null,null,null,null,"ALAMANCE",null,{"$f":"INDEX(I130:I245,MATCH(G4,G130:G245,0),1)","v":"  010"}]
[]
[null,null,"Bus Data"]
[null,null,null,"A.","Number of Days Fleet Operated (maximum 185) ",null,null,null,null,null,"(Sub-Totals)"]
[]
[null,null,null,"B.","Total Bus Mileage for fiscal year"]
[null,null,null,null,1,"Regular & Spare"]
{"$rows_left_out":236}
{"sheet":"Local Expenditures","index":3,"n_rows":120,"n_cols":41,"rows_kept":120,"cut":false,"hidden":false,"merged":[[8,4,8,9],[10,4,10,9],[2,7,5,13],[12,4,12,13],[18,4,18,13],[7,2,7,5],[6,7,7,7],[6,9,7,9],[6,11,7,11],[27,2,27,7],[13,4,13,9],[15,5,15,11],[21,4,21,5],[20,4,20,5],[16,5,16,9],[28,4,28,5],[29,5,29,11],[30,5,30,11],[31,4,31,5],[32,5,32,11],[48,7,51,13],[53,2,53,7],[33,5,33,11],[35,4,35,7],[45,5,45,9],[46,5,46,9],[62,7,62,9],[63,5,63,11],[64,5,64,11],[56,4,56,7],[54,4,54,9],[55,4,55,9],[57,7,57,9],[58,7,58,9],[59,7,59,9],[60,7,60,9],[61,7,61,9],[21,20,22,38],[23,20,23,38],[24,26,25,28],[24,30,25,30],[28,22,30,22],[28,24,30,24],[28,26,30,26],[28,28,30,28],[28,30,30,30],[28,32,30,32],[28,34,30,34],[28,36,30,36],[54,19,56,38],[45,19,47,38],[40,22,40,38],[28,38,30,38],[28,20,30,20],[39,22,39,38]]}
[]
[]
[null,null,null,"Finance Officer Certification",null,null,null,"Expenditures reported on lines 1-5 are limited to payment for drivers transporting students to and from school for a maximum 185 days per year.  It does not consist of payments for field-trips, remediation programs, pre-K programs, etc.",null,null,null,null,null,null,null,null,null,null,null,null,null,null,null,null,null,null,null,null,null,null,null,null,null,null,null,null,null,null,null,null,"(Save, Email, and Print All options available on Accountability worksheet tab)"]
[]
[null,null,null,null,null,null,null,null,null,null,null,null,null,null,null,"(FO Initials)"]
[]
[null,null,null,null,null,null,null,"Current Yearly Rate:",null,17.89,null,"PRC/\nObject Code"]
[null,null,"Bus Drivers - Local Expenditures",null,null,null,null,null,null,null,null,null,null,null,null,"(Subtotals)"]
[null,null,null,"A.","Driver Salary (Except incentive pay/bonuses) (Exclude benefits)",null,null,null,null,null,null,null,null,0]
[]
{"$rows_left_out":111}
{"sheet":"Local Expenditures. (Continued)","index":4,"n_rows":70,"n_cols":20,"rows_kept":70,"cut":false,"hidden":false,"merged":[[4,22,4,24],[2,2,2,7],[3,4,3,7],[35,5,35,9],[48,7,48,9],[39,7,39,9],[40,7,40,9],[41,7,41,9],[36,2,36,7],[42,7,42,9],[43,7,43,9],[37,4,37,7],[38,7,38,9],[44,7,44,9],[58,7,58,9],[54,7,54,9],[55,7,55,9],[56,7,56,9],[57,7,57,9],[67,7,67,9],[68,7,68,9],[69,5,69,11],[59,7,59,9],[60,7,60,9],[61,7,61,9],[62,7,62,9],[63,7,63,9],[64,7,64,9],[65,7,65,9],[66,7,66,9],[50,7,50,9],[51,7,51,9],[52,7,52,9],[53,7,53,9],[45,7,45,9],[46,7,46,9],[47,7,47,9],[49,7,49,9]]}
[]
[]
[null,null,"Transporation Personnel",null,null,null,null,null,null,null,null,null,null,null,null,null,null,null,null,"(Save, Email, and Print All options available on Accountability worksheet tab)"]
[null,null,null,"C.","Personnel Salaries (Local funds) (Continued)"]
[null,null,null,null,null,"Name",null,"Title",null,"PRC/Object Code",null,"Local Salary",null,"Match Benefits"]
[]
[]
[]
[]
[]
{"$rows_left_out":61}
{"sheet":"Policy Questionnaire","index":5,"n_rows":236,"n_cols":14,"rows_kept":236,"cut":false,"hidden":false,"merged":[[102,3,104,4],[47,4,48,4],[53,4,54,4],[36,5,36,6],[38,5,38,6],[40,5,40,6],[30,5,30,6],[42,5,42,6],[2,2,3,4],[8,5,8,6],[10,5,10,6],[12,5,12,6],[14,5,14,6],[16,5,16,6],[6,5,6,6],[5,3,5,4],[20,4,20,5],[24,4,24,5],[32,5,32,6],[34,5,34,6],[21,4,22,4],[6,3,6,4],[30,3,30,4],[4,5,5,6],[68,5,68,6],[78,5,78,6],[70,5,70,6],[72,5,72,6],[74,5,74,6],[76,5,76,6],[58,5,58,6],[60,5,60,6],[62,5,62,6],[64,5,64,6],[66,5,66,6],[121,5,121,6],[2,5,3,6],[126,5,126,6],[130,5,130,6],[46,3,46,5],[52,3,52,5],[58,3,58,4],[82,3,82,5],[90,3,90,5],[96,3,96,5],[113,3,113,4],[126,3,126,4],[109,5,109,6],[113,5,113,6],[115,5,115,6],[117,5,117,6],[119,5,119,6],[102,5,102,6],[104,5,104,6],[106,5,106,6],[98,5,98,6],[84,5,84,6],[86,5,86,6],[92,5,92,6],[134,5,134,6],[136,4,136,6],[138,5,138,6],[140,5,140,6],[134,3,134,4],[144,3,144,4],[128,4,128,6],[144,5,144,6],[146,5,146,6],[148,5,148,6],[150,5,150,6],[152,5,152,6],[154,5,154,6],[156,5,156,6],[158,5,158,6],[160,5,160,6],[162,5,162,6],[191,4,191,5],[166,5,166,6],[164,5,164,6],[192,4,193,4],[195,4,195,5],[182,5,182,6],[183,4,183,6],[185,4,185,6],[170,5,170,6],[172,4,172,6],[174,5,174,6],[176,5,176,6],[170,3,170,4],[178,3,178,6],[182,3,182,4],[187,4,187,6],[189,4,189,6],[223,3,223,4],[229,4,229,6],[231,4,231,6],[233,4,233,6],[235,4,235,6],[217,4,217,6],[219,4,219,6],[223,5,223,6],[225,4,225,6],[227,4,227,6],[207,5,207,6],[209,5,209,6],[213,5,213,6],[215,4,215,6],[196,4,197,4],[199,5,199,6],[201,4,201,6],[203,5,203,6],[205,4,205,6],[213,3,213,4]]}
[]
[]
[null,null,"POLICY QUESTIONNAIRE ",null,null,null,null,null,null,null,null,null,null,"DPI Official Use"]
[]
[null,null,null,null,null,"(Check all that apply)"]
[null,null,"A.","Who has the primary responsibility in your LEA for developing school bus",null,null,null,null,null,null,null,"(Save, Email, and Print All options available on Accountability worksheet tab)"]
[null,null,null,"routes, establishing bus stops and assigning students to buses?",null,"Superintendent/Asst. Superintendent",null,null,null,null,null,null,null,false]
[]
[null,null,null,null,null,"Transportation director"]
[]
{"$rows_left_out":227}
{"sheet":"Inventory","index":6,"n_rows":49,"n_cols":35,"rows_kept":49,"cut":false,"hidden":false,"merged":[[3,34,4,34],[2,21,2,23],[2,26,2,28],[3,8,4,8],[3,21,4,23],[3,18,4,18],[3,26,4,28],[2,2,4,4],[3,5,4,6],[2,5,2,6],[2,11,2,15],[3,11,3,15],[20,4,20,6],[21,4,21,6],[24,2,25,4],[23,13,23,15],[5,5,5,6],[18,4,18,6],[19,4,19,6],[16,2,17,4],[48,1,49,6],[32,4,32,11],[28,2,29,4],[31,4,31,11],[23,18,27,34],[30,18,30,21],[26,4,26,11],[27,13,27,15],[30,4,30,11],[30,23,31,28]]}
[]
[]
[null,null,"Stocked Inventory",null,null,"Charge Account code:",null,null,424,null,null,425,null,null,null,null,null,null,422,null,null,423,null,null,null,null,423,null,null,null,null,423]
[null,null,null,null,null,"Inventory Item:",null,null,"Oil",null,null,"Tires",null,null,null,null,null,null,"Parts \n(Repair)",null,null,"Diesel",null,null,null,null,"Unleaded",null,null,null,null,"Other",null,null,"Total"]
[null,null,null,null,null,null,null,null,null,null,null,"New",null,"Recap",null,"All",null,null,null,null,null,null,null,null,null,null,null,null,null,null,null,"Fuels & DEF"]
[null,null,null,null,null,"Type:",null,null,"Currency",null,null,"Quantity",null,"Quantity",null,"Currency",null,null,"Currency",null,null,"Quantity",null,"Currency",null,null,"Quantity",null,"Currency",null,null,"Currency",null,null,"Currency"]
[]
[null,null,null,"A.","Beginning",{"$f":"\"07/01/\"&(YEAR(TODAY())-1)","v":"07/01/2021"}," ",null,null,null,null,null,null,null,null,null,null,null,null,null,null,null,null,null,null,null,null,null,null,null,null,null,null,null,{"$f":"I8+P8+S8+X8+AC8+AF8","v":0}]
[null,null,null,"B.","Purchased","Fiscal Year"," ",null,null,null,null,null,null,null,null,null,null,null,null,null,null,null,null,null,null,null,null,null,null,null,null,null,null,null,0]
[null,null,null,"C.","Used ","Fiscal Year"," ",null,null,null,null,null,null,null,null,null,null,null,null,null,null,null,null,null,null,null,null,null,null,null,null,null,null,null,0]
{"$rows_left_out":40}
{"sheet":"Obsolete Inventory","index":7,"n_rows":515,"n_cols":19,"rows_kept":515,"cut":false,"hidden":false,"merged":[[2,4,3,5],[2,6,2,7],[11,4,12,4],[11,6,12,6],[11,9,12,9],[11,8,12,8],[11,7,12,7],[11,5,12,5]]}
[]
[]
[null,null,null,null,"Obsolete or Damaged Stock",null,"Summary Information",null,null,null,null,null,null,"(Save, Email, and Print All options available on Accountability worksheet tab)"]
[null,null,null,null,null,null,"Quantity","Value"]
[null,null,null,null,null,"Oil",{"$f":"SUMIF($J$14:$J$513,F5,G$14:G$513)","v":0},{"$f":"SUMIF($J$14:$J$513,F5,H$14:H$513)","v":0}]
[null,null,null,null,null,"Tires",{"$f":"SUMIF($J$14:$J$513,F6,G$14:G$513)","v":0},{"$f":"IF(SUMIF($J$14:$J$513,F6,H$14:H$513),SUMIF($J$14:$J$513,F6,H$14:H$513),0)","v":0}]
[null,null,null,null,null,"Repair Parts",{"$f":"SUMIF($J$14:$J$513,F7,G$14:G$513)","v":0},{"$f":"IF(SUMIF($J$14:$J$513,F7,H$14:H$513),SUMIF($J$14:$J$513,F7,H$14:H$513),0)","v":0}]
[null,null,null,null,null,"Diesel",{"$f":"IF(SUMIF($J$14:$J$513,F8,G$14:G$513),SUMIF($J$14:$J$513,F8,G$14:G$513),0)","v":0},{"$f":"IF(SUMIF($J$14:$J$513,F8,H$14:H$513),SUMIF($J$14:$J$513,F8,H$14:H$513),0)","v":0}]
[null,null,null,null,null,"Gasoline",{"$f":"IF(SUMIF($J$14:$J$513,F9,G$14:G$513),SUMIF($J$14:$J$513,F9,G$14:G$513),0)","v":0},{"$f":"IF(SUMIF($J$14:$J$513,F9,H$14:H$513),SUMIF($J$14:$J$513,F9,H$14:H$513),0)","v":0}]
[null,null,null,null,null,"Other Fuels / DEF",{"$f":"IF(SUMIF($J$14:$J$513,F10,G$14:G$513),SUMIF($J$14:$J$513,F10,G$14:G$513),0)","v":0},{"$f":"IF(SUMIF($J$14:$J$513,F10,H$14:H$513),SUMIF($J$14:$J$513,F10,H$14:H$513),0)","v":0}]
{"$rows_left_out":506}
{"sheet":"Buster Report","index":8,"n_rows":39,"n_cols":40,"rows_kept":39,"cut":false,"hidden":false,"merged":[[8,27,9,27],[8,11,9,11],[8,13,9,13],[8,15,9,15],[8,17,9,17],[8,23,9,23],[8,25,9,25],[8,19,9,19],[8,21,9,21],[8,7,9,7],[8,6,9,6],[2,2,3,4],[8,9,9,9],[6,3,6,7],[8,5,9,5],[13,9,13,27],[14,13,15,13],[14,15,15,15],[14,17,15,17],[14,19,15,19],[14,21,15,21],[14,23,15,23],[14,27,15,27],[22,1,22,2],[23,1,23,2],[20,1,20,2],[14,25,15,25],[18,1,18,2],[19,1,19,2],[14,6,15,6],[14,7,15,7],[14,9,15,9],[14,11,15,11],[21,1,21,2],[14,4,15,4],[14,3,15,3],[14,1,15,2],[17,1,17,2],[14,5,15,5],[33,1,33,2],[34,1,34,2],[35,1,35,2],[36,1,36,2],[24,1,24,2],[25,1,25,2],[26,1,26,2],[27,1,27,2],[28,1,28,2],[29,1,29,2],[30,1,30,2],[31,1,31,2],[32,1,32,2]]}
[]
[]
[null,null,"Buster Report"]
[null,null,null,null,null,null,null,null,null,null,null,null,null,null,null,null,null,null,null,null,null,null,null,null,null,null,null,null,null,"(Save, Email, and Print All options available on Accountability worksheet tab)"]
[null,null,null,"LEA #",{"$f":"'Bus Data'!I4","v":"  010"},null,null,null,null,null,null,null,null,null,null,null,null,null,null,null,null,null,null,null,null,null,null,null,null,null,null,true]
[]
[null,null,null,"Check if LEA does not own/share a Buster Robotic Bus"]
[]
[null,null,null,"Summary",null,"Time","Local","Individuals \nPresent",null,"Pre \nK",null,"K",null,1,null,2,null,3,null,4,null,5,null,6,null,"7-12",null,"Public \nDemo"]
[]
{"$rows_left_out":30}
{"sheet":"Official Summary","index":9,"n_rows":78,"n_cols":31,"rows_kept":78,"cut":false,"hidden":false,"merged":[[53,3,64,3],[62,4,64,4],[49,3,49,5],[50,3,50,5],[3,3,3,6],[4,3,4,5],[5,3,5,5],[7,3,7,5],[13,3,13,5],[18,3,18,5],[18,11,18,12],[9,11,10,11],[17,11,17,12],[4,30,5,30],[4,20,5,20],[3,21,3,23],[4,21,4,23],[3,25,3,26],[4,25,5,26],[3,27,3,28],[4,27,5,28],[4,24,5,24]]}
[]
[]
[null,null,"Bus Data Tab",null,null,null,null,null,null,null,"Policy Tab",null,null,null,null,null,null,null,"Inventory Tab"]
[null,null,null,"LEA",null,null,null,null,null,null,null,"A.",null,{"$f":"IF('Policy Questionnaire'!N7,\"X\",\"\")","v":""},"Supt./Asst. Supt.",null,null,null,null,null,424,425,null,null,422,423,null,423,null,423]
[null,null,null,"Name",null,null,{"$f":"'Bus Data'!G4","v":"ALAMANCE"},null,null,null,null,null,null,{"$f":"IF('Policy Questionnaire'!N9,\"X\",\"\")","v":""},"Transportation director",null,null,null,null,null,"Oil","Tires",null,null,"Parts \n(Repair)","Diesel",null,"Unleaded",null,"Other","Total"]
[null,null,null,"Code",null,null,{"$f":"'Bus Data'!I4","v":"  010"},null,null,null,null,null,null,{"$f":"IF('Policy Questionnaire'!N11,\"X\",\"\")","v":""},"Principals",null,null,null,null,null,null,"New","Recap","All",null,null,null,null,null,"Fuels & DEF"]
[null,null,null,null,null,null,null,null,null,null,null,null,null,{"$f":"IF('Policy Questionnaire'!N13,\"X\",\"\")","v":""},"TIMS Coordinator",null,null,null,null,null,"Currency","Quantity","Quantity","Currency","Currency","Quantity","Currency","Quantity","Currency","Currency","Currency"]
[null,null,"Bus Data","A.",null,null,{"$f":"'Bus Data'!$I$7","v":0},null,null,null,null,null,null,{"$f":"IF('Policy Questionnaire'!N15,\"X\",\"\")","v":""},"Trans. supervisor",null,null,null,null,"A.",{"$f":"Inventory!I8","v":0},{"$f":"Inventory!L8","v":0},{"$f":"Inventory!N8","v":0},{"$f":"Inventory!P8","v":0},{"$f":"Inventory!S8","v":0},{"$f":"Inventory!V8","v":0},{"$f":"Inventory!X8","v":0},{"$f":"Inventory!AA8","v":0},{"$f":"Inventory!AC8","v":0},{"$f":"Inventory!AF8","v":0},{"$f":"Inventory!AI8","v":0}]
[null,null,null,"B.",1,null,{"$f":"'Bus Data'!I10","v":0},null,null,null,null,null,null,{"$f":"IF('Policy Questionnaire'!N17,\"X\",\"\")","v":""},{"$f":"IF('Policy Questionnaire'!F17<>\"\",'Policy Questionnaire'!F17,\"Other Ln A\")","v":"Other Ln A"},null,null,null,null,"B.",{"$f":"Inventory!I9","v":0},{"$f":"Inventory!L9","v":0},{"$f":"Inventory!N9","v":0},{"$f":"Inventory!P9","v":0},{"$f":"Inventory!S9","v":0},{"$f":"Inventory!V9","v":0},{"$f":"Inventory!X9","v":0},{"$f":"Inventory!AA9","v":0},{"$f":"Inventory!AC9","v":0},{"$f":"Inventory!AF9","v":0},{"$f":"Inventory!AI9","v":0}]
[null,null,null,null,2,null,{"$f":"'Bus Data'!I11","v":0},null,null,null,null,"B.","a.",{"$f":"IF('Policy Questionnaire'!N21,\"Yes\",\"No\")","v":"No"},"Yes/No",null,null,null,null,"C.",{"$f":"Inventory!I10","v":0},{"$f":"Inventory!L10","v":0},{"$f":"Inventory!N10","v":0},{"$f":"Inventory!P10","v":0},{"$f":"Inventory!S10","v":0},{"$f":"Inventory!V10","v":0},{"$f":"Inventory!X10","v":0},{"$f":"Inventory!AA10","v":0},{"$f":"Inventory!AC10","v":0},{"$f":"Inventory!AF10","v":0},{"$f":"Inventory!AI10","v":0}]
{"$rows_left_out":69}
{"sheet":"Policy Summary","index":10,"n_rows":7,"n_cols":77,"rows_kept":7,"cut":false,"hidden":false,"merged":[[3,10,3,11],[3,18,4,18],[3,19,4,19]]}
[]
[]
[]
[null,null,null,null,"A.",null,null,null,null,null,"B.",null,"C.",null,null,null,null,null,"D.","E.","F.",null,null,null,null,null,null,null,null,null,"G.",null,null,"H.",null,"I.",null,"J.",null,null,null,"K.",null,null,null,"L.",null,"M.","N.",null,null,null,null,null,null,null,null,null,null,"O.","P.","Q.",null,null,null,null,null,null,"R.",null,null,"S."]
[null,null,null,null,null,null,null,null,null,null,"a.","b.",null,null,null,null,null,null,null,null,null,null,null,null,null,null,null,null,null,null,null,null,null,null,null,null,null,null,null,null,null,null,null,null,null,null,null,null,null,null,null,null,null,null,null,null,null,null,null,null,null,"a.","b.","c.","d.","e.","f.","g.","a.","b.","c.","a.","b.","c.","d.","e.","f."]
[null,"LEA","Code",null,"Supt./Asst. Supt.","Transportation director","Principals","TIMS Coordinator","Trans. supervisor",{"$f":"'Official Summary'!O9","v":"Other Ln A"},"Yes/No","Yes/No","Supt./Asst. Supt.","Transportation director","Principals","TIMS Coordinator","Trans. supervisor",{"$f":"'Official Summary'!O17","v":"Other Ln C"},"Yes/No","Yes/No","At-risk BEP","Pre-K Handicapped","Head Start","At-risk Remediation","Migrant Education","DARE Program","Local Enrichment","SOS Plus","VIPERS Program",{"$f":"'Official Summary'!O29","v":"Other Ln F"},"None","Regular Students","Special Educ. Students","AM","None","PM","None","Food service/Driver","Custodial/Driver","Teacher Asst/Driver",{"$f":"'Official Summary'!O40","v":"Other Ln J"},"Food service/Driver","Custodial/Driver","Teacher Asst/Driver",{"$f":"'Official Summary'!O44","v":"Other Ln K"},"Adopted Policy History Check ","Required for Pre-Employment","Background check","Criminal Background Search","FBI Background Check","State Background Check","Local Background Check","National Background Check","Police Record Search","Sex Offender Search","Driving Record Search","Prison Inmate Search","Vehicle History Search",{"$f":"IF('Policy Questionnaire'!$F$167<>\"\",'Policy Questionnaire'!$F$167,\"Other Ln N\")","v":"Other Ln N"},"Inventory","# of persons assigned","TIMS 75%-100% of their time","TIMS 50%-74% of their time?","TIMS 25%-49% of their time?","TIMS 1%-24% of their time?","Editing Powerschool?","Read only Powerschool?","Upload schedule TIMS","Students Transported","Buses Dedicated","Service Charter Buses","Mech I positions","Mech II positions","Mech III positions","Mech I annual avg salary","Mech II annual avg salary","Mech III annual avg salary"]
[null,{"$f":"'Bus Data'!G4","v":"ALAMANCE"},{"$f":"'Official Summary'!G6","v":"  010"},null,{"$f":"'Official Summary'!N4","v":""},{"$f":"'Official Summary'!N5","v":""},{"$f":"'Official Summary'!N6","v":""},{"$f":"'Official Summary'!N7","v":""},{"$f":"'Official Summary'!N8","v":""},{"$f":"'Official Summary'!N9","v":""},{"$f":"'Official Summary'!N10","v":"No"},{"$f":"'Official Summary'!N11","v":"No"},{"$f":"'Official Summary'!N12","v":""},{"$f":"'Official Summary'!N13","v":""},{"$f":"'Official Summary'!N14","v":""},{"$f":"'Official Summary'!N15","v":""},{"$f":"'Official Summary'!N16","v":""},{"$f":"'Official Summary'!N17","v":""},{"$f":"'Official Summary'!N18","v":"No"},{"$f":"'Official Summary'!N19","v":"No"},{"$f":"'Official Summary'!N20","v":""},{"$f":"'Official Summary'!N21","v":""},{"$f":"'Official Summary'!N22","v":""},{"$f":"'Official Summary'!N23","v":""},{"$f":"'Official Summary'!N24","v":""},{"$f":"'Official Summary'!N25","v":""},{"$f":"'Official Summary'!N26","v":""},{"$f":"'Official Summary'!N27","v":""},{"$f":"'Official Summary'!N28","v":""},{"$f":"'Official Summary'!N29","v":""},{"$f":"'Official Summary'!N30","v":""},{"$f":"'Official Summary'!N31","v":0},{"$f":"'Official Summary'!N32","v":0},{"$f":"'Official Summary'!N33","v":0},{"$f":"'Official Summary'!N34","v":""},{"$f":"'Official Summary'!N35","v":"00:00:00"},{"$f":"'Official Summary'!N36","v":""},{"$f":"'Official Summary'!N37","v":0},{"$f":"'Official Summary'!N38","v":0},{"$f":"'Official Summary'!N39","v":0},{"$f":"'Official Summary'!N40","v":0},{"$f":"'Official Summary'!N41","v":""},{"$f":"'Official Summary'!N42","v":""},{"$f":"'Official Summary'!N43","v":""},{"$f":"'Official Summary'!N44","v":""},{"$f":"'Official Summary'!N45","v":""},{"$f":"'Official Summary'!N46","v":""},{"$f":"'Official Summary'!N47","v":""},{"$f":"'Official Summary'!N48","v":""},{"$f":"'Official Summary'!N49","v":""},{"$f":"'Official Summary'!N50","v":""},{"$f":"'Official Summary'!N51","v":""},{"$f":"'Official Summary'!N52","v":""},{"$f":"'Official Summary'!N53","v":""},{"$f":"'Official Summary'!N54","v":""},{"$f":"'Official Summary'!N55","v":""},{"$f":"'Official Summary'!N56","v":""},{"$f":"'Official Summary'!N57","v":""},{"$f":"'Official Summary'!N58","v":""},{"$f":"'Official Summary'!N59","v":"Other Ln O"},{"$f":"'Official Summary'!N60","v":0},{"$f":"'Official Summary'!N61","v":0},{"$f":"'Official Summary'!N62","v":0},{"$f":"'Official Summary'!N63","v":0},{"$f":"'Official Summary'!N64","v":0},{"$f":"'Official Summary'!N65","v":""},{"$f":"'Official Summary'!N66","v":""},{"$f":"'Official Summary'!N67","v":""},{"$f":"'Official Summary'!N68","v":0},{"$f":"'Official Summary'!N69","v":0},{"$f":"'Official Summary'!N70","v":0},{"$f":"'Official Summary'!N71","v":0},{"$f":"'Official Summary'!N72","v":0},{"$f":"'Official Summary'!N73","v":0},{"$f":"'Official Summary'!N74","v":0},{"$f":"'Official Summary'!N75","v":0},{"$f":"'Official Summary'!N76","v":0}]